{"text_format":"1","workbook":"xlsx","n_sheets":9,"sheets":["About Transfers","Transfer In","Transfer Out","Tie to Budget Construction","Import Data","Upload to Budget Construction","Upload","Pivot","Object Codes"],"not_rendered":{"charts":0,"images":0,"macros":1,"external_links":5,"defined_names":62,"comments":0,"pivot_tables":1},"unopened":[],"bounds":{"document_bytes":16777216,"sheet_cells":100000,"rows_first":2000,"rows_last":500,"rows_between":2000,"halvings":0,"cell_chars":16384,"cell_head_chars":4096},"cells_cut":0,"cells_raw":0,"read":"whole","date_system":"1900"}

{"sheet":"About Transfers","index":0,"n_rows":34,"n_cols":1,"rows_kept":34,"cut":false,"hidden":false,"merged":[]}
[]
[]
[]
[]
[]
[]
[]
[]
[]
[]
[]
[]
[]
[]
[]
[]
[]
[]
[]
[]
[]
[]
[]
[]
[]
[]
[]
[]
[]
[]
[]
["ALL transfers outside of the School/College/Unit must be included in this file and tie to Budget Construction"]
[]
["Contact your Budget Analyst or the Budget Office with any assistance needed in completing this workbook"]

{"sheet":"Transfer In","index":1,"n_rows":110,"n_cols":7,"rows_kept":110,"cut":false,"hidden":false,"merged":[[6,1,6,6],[7,1,7,6]]}
["UCONN FY18 Budget Submission Transfer Reconciliation"]
[]
[]
[null,"Org Name:"]
[null,"Org Code:"]
[]
[null,"FOR ENTRY"]
[null,"Transfers IN Only\nIn this section enter any transfers coming IN to your account.  "]
[null,"Account \n(The Account the Transfer is coming to)","Object Code\n (The Object code being used)","From Account\n(Enter the Account you are receiving the transfer from)","If Account # is unknown\nFrom Org\n(Enter the Org you are receiving the transfer from)","Amount\n(Enter the $ Amount of the Transfer)","Explanation of Transfer\n (Provide a brief explanation of the transfer you are receiving)"]
[1]
[{"$f":"+A10+1","v":2}]
[{"$f":"+A11+1","v":3}]
[4]
[5]
[6]
[7]
[8]
[9]
[10]
[11]
[12]
[13]
[14]
[15]
[16]
[17]
[18]
[19]
[20]
[21]
[22]
[23]
[24]
[25]
[26]
[27]
[28]
[29]
[30]
[31]
{"$rows_left_out":71}
{"sheet":"Transfer Out","index":2,"n_rows":110,"n_cols":7,"rows_kept":110,"cut":false,"hidden":false,"merged":[[6,1,6,6],[7,1,7,6]]}
["UCONN FY18 Budget Submission Transfer Reconciliation"]
[]
[]
[null,"Org Name:"]
[null,"Org Code:"]
[]
[null,"FOR ENTRY"]
[null,"Transfers OUT Only\nIn this section enter any transfers coming OUT of your account.  "]
[null,"Account \n(The Account the Transfer is coming from)","Object Code\n (The Object code being used)","To Account\n(Enter the Account you are sending the transfer to)","If Account # is unknown\nTo Org\n(Enter the Org you are sending the transfer to)","Amount\n(Enter the $ Amount of the Transfer)","Explanation of Transfer\n (Provide a brief explanation of the transfer you are receiving)"]
[1]
[2]
[3]
[4]
[5]
[6]
[7]
[8]
[9]
[10]
[11]
[12]
[13]
[14]
[15]
[16]
[17]
[18]
[19]
[20]
[21]
[22]
[23]
[24]
[25]
[26]
[27]
[28]
[29]
[30]
[31]
{"$rows_left_out":71}
{"sheet":"Tie to Budget Construction","index":3,"n_rows":19,"n_cols":4,"rows_kept":19,"cut":false,"hidden":false,"merged":[[0,1,0,3],[1,1,1,3],[2,1,2,3],[4,1,4,3],[13,1,13,3]]}
[null,"Budget Construction Reconciliation Tab"]
[null,"This Tab is NOT for Entry "]
[null,"Transfers OUTSIDE of Unit Only"]
[]
[null,"Transfers IN Only - Total UNIT"]
[]
[null,"Object Code","Object Code Name","Amount"]
[null,3201,"Transfer In (Outside Unit)   ",{"$f":"+'Object Codes'!E28","v":0}]
[null,3207,"2Ledger Perm Transfer-In (Outside Unit)   ",{"$f":"+'Object Codes'!E29","v":0}]
[null,3209,"2Ledger One-Time Trans In (Outside Unit)",{"$f":"+'Object Codes'!E30","v":0}]
[null,3210,"Interfund Transfer In Mandatory",{"$f":"+'Object Codes'!E31","v":0}]
[]
[]
[null,"Transfers OUT Only - Total UNIT"]
[]
[null,"Object Code","Object Code Name","Amount"]
[null,{"$f":"+B8+100","v":3301},"Transfer Out (Outside Unit)   ",{"$f":"+'Object Codes'!E35","v":0}]
[null,{"$f":"+B9+100","v":3307},"2Ledger Perm Transfer-Out (Outside Unit)   ",{"$f":"+'Object Codes'!E36","v":0}]
[null,{"$f":"+B10+100","v":3309},"2Ledger One-Time Trans Out (Outside Unit)",{"$f":"+'Object Codes'!E37","v":0}]

{"sheet":"Import Data","index":4,"n_rows":202,"n_cols":6,"rows_kept":202,"cut":false,"hidden":true,"merged":[]}
[]
["Type","Chart","Row","Account \n(The Account the Transfer is coming to)","Object Code\n (The Object code being used)","Amount\n(Enter the $ Amount of the Transfer)"]
["IN","UC",{"$f":"+'[4]Transfer IN'!A10","v":1},{"$f":"IF('Transfer In'!B10=\"\",\"\",+'Transfer In'!B10)","v":""},{"$f":"LEFT('Transfer In'!C10,4)","v":""},{"$f":"IF('Transfer In'!F10=\"\",\"\",+'Transfer In'!F10)","v":""}]
["IN","UC",{"$f":"+'[4]Transfer IN'!A11","v":2},{"$f":"IF('Transfer In'!B11=\"\",\"\",+'Transfer In'!B11)","v":""},{"$f":"LEFT('Transfer In'!C11,4)","v":""},{"$f":"IF('Transfer In'!F11=\"\",\"\",+'Transfer In'!F11)","v":""}]
["IN","UC",{"$f":"+'[4]Transfer IN'!A12","v":3},{"$f":"IF('Transfer In'!B12=\"\",\"\",+'Transfer In'!B12)","v":""},{"$f":"LEFT('Transfer In'!C12,4)","v":""},{"$f":"IF('Transfer In'!F12=\"\",\"\",+'Transfer In'!F12)","v":""}]
["IN","UC",{"$f":"+'[4]Transfer IN'!A13","v":4},{"$f":"IF('Transfer In'!B13=\"\",\"\",+'Transfer In'!B13)","v":""},{"$f":"LEFT('Transfer In'!C13,4)","v":""},{"$f":"IF('Transfer In'!F13=\"\",\"\",+'Transfer In'!F13)","v":""}]
["IN","UC",{"$f":"+'[4]Transfer IN'!A14","v":5},{"$f":"IF('Transfer In'!B14=\"\",\"\",+'Transfer In'!B14)","v":""},{"$f":"LEFT('Transfer In'!C14,4)","v":""},{"$f":"IF('Transfer In'!F14=\"\",\"\",+'Transfer In'!F14)","v":""}]
["IN","UC",{"$f":"+'[4]Transfer IN'!A15","v":6},{"$f":"IF('Transfer In'!B15=\"\",\"\",+'Transfer In'!B15)","v":""},{"$f":"LEFT('Transfer In'!C15,4)","v":""},{"$f":"IF('Transfer In'!F15=\"\",\"\",+'Transfer In'!F15)","v":""}]
["IN","UC",{"$f":"+'[4]Transfer IN'!A16","v":7},{"$f":"IF('Transfer In'!B16=\"\",\"\",+'Transfer In'!B16)","v":""},{"$f":"LEFT('Transfer In'!C16,4)","v":""},{"$f":"IF('Transfer In'!F16=\"\",\"\",+'Transfer In'!F16)","v":""}]
["IN","UC",{"$f":"+'[4]Transfer IN'!A17","v":8},{"$f":"IF('Transfer In'!B17=\"\",\"\",+'Transfer In'!B17)","v":""},{"$f":"LEFT('Transfer In'!C17,4)","v":""},{"$f":"IF('Transfer In'!F17=\"\",\"\",+'Transfer In'!F17)","v":""}]
["IN","UC",{"$f":"+'[4]Transfer IN'!A18","v":9},{"$f":"IF('Transfer In'!B18=\"\",\"\",+'Transfer In'!B18)","v":""},{"$f":"LEFT('Transfer In'!C18,4)","v":""},{"$f":"IF('Transfer In'!F18=\"\",\"\",+'Transfer In'!F18)","v":""}]
["IN","UC",{"$f":"+'[4]Transfer IN'!A19","v":10},{"$f":"IF('Transfer In'!B19=\"\",\"\",+'Transfer In'!B19)","v":""},{"$f":"LEFT('Transfer In'!C19,4)","v":""},{"$f":"IF('Transfer In'!F19=\"\",\"\",+'Transfer In'!F19)","v":""}]
["IN","UC",{"$f":"+'[4]Transfer IN'!A20","v":11},{"$f":"IF('Transfer In'!B20=\"\",\"\",+'Transfer In'!B20)","v":""},{"$f":"LEFT('Transfer In'!C20,4)","v":""},{"$f":"IF('Transfer In'!F20=\"\",\"\",+'Transfer In'!F20)","v":""}]
["IN","UC",{"$f":"+'[4]Transfer IN'!A21","v":12},{"$f":"IF('Transfer In'!B21=\"\",\"\",+'Transfer In'!B21)","v":""},{"$f":"LEFT('Transfer In'!C21,4)","v":""},{"$f":"IF('Transfer In'!F21=\"\",\"\",+'Transfer In'!F21)","v":""}]
["IN","UC",{"$f":"+'[4]Transfer IN'!A22","v":13},{"$f":"IF('Transfer In'!B22=\"\",\"\",+'Transfer In'!B22)","v":""},{"$f":"LEFT('Transfer In'!C22,4)","v":""},{"$f":"IF('Transfer In'!F22=\"\",\"\",+'Transfer In'!F22)","v":""}]
["IN","UC",{"$f":"+'[4]Transfer IN'!A23","v":14},{"$f":"IF('Transfer In'!B23=\"\",\"\",+'Transfer In'!B23)","v":""},{"$f":"LEFT('Transfer In'!C23,4)","v":""},{"$f":"IF('Transfer In'!F23=\"\",\"\",+'Transfer In'!F23)","v":""}]
["IN","UC",{"$f":"+'[4]Transfer IN'!A24","v":15},{"$f":"IF('Transfer In'!B24=\"\",\"\",+'Transfer In'!B24)","v":""},{"$f":"LEFT('Transfer In'!C24,4)","v":""},{"$f":"IF('Transfer In'!F24=\"\",\"\",+'Transfer In'!F24)","v":""}]
["IN","UC",{"$f":"+'[4]Transfer IN'!A25","v":16},{"$f":"IF('Transfer In'!B25=\"\",\"\",+'Transfer In'!B25)","v":""},{"$f":"LEFT('Transfer In'!C25,4)","v":""},{"$f":"IF('Transfer In'!F25=\"\",\"\",+'Transfer In'!F25)","v":""}]
["IN","UC",{"$f":"+'[4]Transfer IN'!A26","v":17},{"$f":"IF('Transfer In'!B26=\"\",\"\",+'Transfer In'!B26)","v":""},{"$f":"LEFT('Transfer In'!C26,4)","v":""},{"$f":"IF('Transfer In'!F26=\"\",\"\",+'Transfer In'!F26)","v":""}]
["IN","UC",{"$f":"+'[4]Transfer IN'!A27","v":18},{"$f":"IF('Transfer In'!B27=\"\",\"\",+'Transfer In'!B27)","v":""},{"$f":"LEFT('Transfer In'!C27,4)","v":""},{"$f":"IF('Transfer In'!F27=\"\",\"\",+'Transfer In'!F27)","v":""}]
["IN","UC",{"$f":"+'[4]Transfer IN'!A28","v":19},{"$f":"IF('Transfer In'!B28=\"\",\"\",+'Transfer In'!B28)","v":""},{"$f":"LEFT('Transfer In'!C28,4)","v":""},{"$f":"IF('Transfer In'!F28=\"\",\"\",+'Transfer In'!F28)","v":""}]
["IN","UC",{"$f":"+'[4]Transfer IN'!A29","v":20},{"$f":"IF('Transfer In'!B29=\"\",\"\",+'Transfer In'!B29)","v":""},{"$f":"LEFT('Transfer In'!C29,4)","v":""},{"$f":"IF('Transfer In'!F29=\"\",\"\",+'Transfer In'!F29)","v":""}]
["IN","UC",{"$f":"+'[4]Transfer IN'!A30","v":21},{"$f":"IF('Transfer In'!B30=\"\",\"\",+'Transfer In'!B30)","v":""},{"$f":"LEFT('Transfer In'!C30,4)","v":""},{"$f":"IF('Transfer In'!F30=\"\",\"\",+'Transfer In'!F30)","v":""}]
["IN","UC",{"$f":"+'[4]Transfer IN'!A31","v":22},{"$f":"IF('Transfer In'!B31=\"\",\"\",+'Transfer In'!B31)","v":""},{"$f":"LEFT('Transfer In'!C31,4)","v":""},{"$f":"IF('Transfer In'!F31=\"\",\"\",+'Transfer In'!F31)","v":""}]
["IN","UC",{"$f":"+'[4]Transfer IN'!A32","v":23},{"$f":"IF('Transfer In'!B32=\"\",\"\",+'Transfer In'!B32)","v":""},{"$f":"LEFT('Transfer In'!C32,4)","v":""},{"$f":"IF('Transfer In'!F32=\"\",\"\",+'Transfer In'!F32)","v":""}]
["IN","UC",{"$f":"+'[4]Transfer IN'!A33","v":24},{"$f":"IF('Transfer In'!B33=\"\",\"\",+'Transfer In'!B33)","v":""},{"$f":"LEFT('Transfer In'!C33,4)","v":""},{"$f":"IF('Transfer In'!F33=\"\",\"\",+'Transfer In'!F33)","v":""}]
["IN","UC",{"$f":"+'[4]Transfer IN'!A34","v":25},{"$f":"IF('Transfer In'!B34=\"\",\"\",+'Transfer In'!B34)","v":""},{"$f":"LEFT('Transfer In'!C34,4)","v":""},{"$f":"IF('Transfer In'!F34=\"\",\"\",+'Transfer In'!F34)","v":""}]
["IN","UC",{"$f":"+'[4]Transfer IN'!A35","v":26},{"$f":"IF('Transfer In'!B35=\"\",\"\",+'Transfer In'!B35)","v":""},{"$f":"LEFT('Transfer In'!C35,4)","v":""},{"$f":"IF('Transfer In'!F35=\"\",\"\",+'Transfer In'!F35)","v":""}]
["IN","UC",{"$f":"+'[4]Transfer IN'!A36","v":27},{"$f":"IF('Transfer In'!B36=\"\",\"\",+'Transfer In'!B36)","v":""},{"$f":"LEFT('Transfer In'!C36,4)","v":""},{"$f":"IF('Transfer In'!F36=\"\",\"\",+'Transfer In'!F36)","v":""}]
["IN","UC",{"$f":"+'[4]Transfer IN'!A37","v":28},{"$f":"IF('Transfer In'!B37=\"\",\"\",+'Transfer In'!B37)","v":""},{"$f":"LEFT('Transfer In'!C37,4)","v":""},{"$f":"IF('Transfer In'!F37=\"\",\"\",+'Transfer In'!F37)","v":""}]
["IN","UC",{"$f":"+'[4]Transfer IN'!A38","v":29},{"$f":"IF('Transfer In'!B38=\"\",\"\",+'Transfer In'!B38)","v":""},{"$f":"LEFT('Transfer In'!C38,4)","v":""},{"$f":"IF('Transfer In'!F38=\"\",\"\",+'Transfer In'!F38)","v":""}]
["IN","UC",{"$f":"+'[4]Transfer IN'!A39","v":30},{"$f":"IF('Transfer In'!B39=\"\",\"\",+'Transfer In'!B39)","v":""},{"$f":"LEFT('Transfer In'!C39,4)","v":""},{"$f":"IF('Transfer In'!F39=\"\",\"\",+'Transfer In'!F39)","v":""}]
["IN","UC",{"$f":"+'[4]Transfer IN'!A40","v":31},{"$f":"IF('Transfer In'!B40=\"\",\"\",+'Transfer In'!B40)","v":""},{"$f":"LEFT('Transfer In'!C40,4)","v":""},{"$f":"IF('Transfer In'!F40=\"\",\"\",+'Transfer In'!F40)","v":""}]
["IN","UC",{"$f":"+'[4]Transfer IN'!A41","v":32},{"$f":"IF('Transfer In'!B41=\"\",\"\",+'Transfer In'!B41)","v":""},{"$f":"LEFT('Transfer In'!C41,4)","v":""},{"$f":"IF('Transfer In'!F41=\"\",\"\",+'Transfer In'!F41)","v":""}]
["IN","UC",{"$f":"+'[4]Transfer IN'!A42","v":33},{"$f":"IF('Transfer In'!B42=\"\",\"\",+'Transfer In'!B42)","v":""},{"$f":"LEFT('Transfer In'!C42,4)","v":""},{"$f":"IF('Transfer In'!F42=\"\",\"\",+'Transfer In'!F42)","v":""}]
["IN","UC",{"$f":"+'[4]Transfer IN'!A43","v":34},{"$f":"IF('Transfer In'!B43=\"\",\"\",+'Transfer In'!B43)","v":""},{"$f":"LEFT('Transfer In'!C43,4)","v":""},{"$f":"IF('Transfer In'!F43=\"\",\"\",+'Transfer In'!F43)","v":""}]
["IN","UC",{"$f":"+'[4]Transfer IN'!A44","v":35},{"$f":"IF('Transfer In'!B44=\"\",\"\",+'Transfer In'!B44)","v":""},{"$f":"LEFT('Transfer In'!C44,4)","v":""},{"$f":"IF('Transfer In'!F44=\"\",\"\",+'Transfer In'!F44)","v":""}]
["IN","UC",{"$f":"+'[4]Transfer IN'!A45","v":36},{"$f":"IF('Transfer In'!B45=\"\",\"\",+'Transfer In'!B45)","v":""},{"$f":"LEFT('Transfer In'!C45,4)","v":""},{"$f":"IF('Transfer In'!F45=\"\",\"\",+'Transfer In'!F45)","v":""}]
["IN","UC",{"$f":"+'[4]Transfer IN'!A46","v":37},{"$f":"IF('Transfer In'!B46=\"\",\"\",+'Transfer In'!B46)","v":""},{"$f":"LEFT('Transfer In'!C46,4)","v":""},{"$f":"IF('Transfer In'!F46=\"\",\"\",+'Transfer In'!F46)","v":""}]
["IN","UC",{"$f":"+'[4]Transfer IN'!A47","v":38},{"$f":"IF('Transfer In'!B47=\"\",\"\",+'Transfer In'!B47)","v":""},{"$f":"LEFT('Transfer In'!C47,4)","v":""},{"$f":"IF('Transfer In'!F47=\"\",\"\",+'Transfer In'!F47)","v":""}]
{"$rows_left_out":163}
{"sheet":"Upload to Budget Construction","index":5,"n_rows":12,"n_cols":1,"rows_kept":12,"cut":false,"hidden":false,"merged":[]}
["UCONN FY18 Budget Submission Transfer Upload to Budget Construction"]
[]
["To create a file to automatically upload transfers to Budget construction, click the \"Create BC Upload File\" button below:"]
[]
[]
[]
[]
["The Upload tab should not be modified in any way, otherwise an error will occur."]
[]
["For detailed instruction the users manual highlights the upload process of contact your Budget Analyst."]
[]
["http://budget.uconn.edu/wp-content/uploads/sites/1441/2017/03/FY18-Budget-Construction-Procedure-Manual.pdf"]

{"sheet":"Upload","index":6,"n_rows":200,"n_cols":6,"rows_kept":200,"cut":false,"hidden":false,"merged":[]}
[{"$f":"+Pivot!G25","v":""},{"$f":"+Pivot!F25","v":""},null,{"$f":"+Pivot!H25","v":""},null,{"$f":"+Pivot!I25","v":""}]
[{"$f":"+Pivot!G26","v":""},{"$f":"+Pivot!F26","v":""},null,{"$f":"+Pivot!H26","v":""},null,{"$f":"+Pivot!I26","v":""}]
[{"$f":"+Pivot!G27","v":""},{"$f":"+Pivot!F27","v":""},null,{"$f":"+Pivot!H27","v":""},null,{"$f":"+Pivot!I27","v":""}]
[{"$f":"+Pivot!G28","v":""},{"$f":"+Pivot!F28","v":""},null,{"$f":"+Pivot!H28","v":""},null,{"$f":"+Pivot!I28","v":""}]
[{"$f":"+Pivot!G29","v":""},{"$f":"+Pivot!F29","v":""},null,{"$f":"+Pivot!H29","v":""},null,{"$f":"+Pivot!I29","v":""}]
[{"$f":"+Pivot!G30","v":""},{"$f":"+Pivot!F30","v":""},null,{"$f":"+Pivot!H30","v":""},null,{"$f":"+Pivot!I30","v":""}]
[{"$f":"+Pivot!G31","v":""},{"$f":"+Pivot!F31","v":""},null,{"$f":"+Pivot!H31","v":""},null,{"$f":"+Pivot!I31","v":""}]
[{"$f":"+Pivot!G32","v":""},{"$f":"+Pivot!F32","v":""},null,{"$f":"+Pivot!H32","v":""},null,{"$f":"+Pivot!I32","v":""}]
[{"$f":"+Pivot!G33","v":""},{"$f":"+Pivot!F33","v":""},null,{"$f":"+Pivot!H33","v":""},null,{"$f":"+Pivot!I33","v":""}]
[{"$f":"+Pivot!G34","v":""},{"$f":"+Pivot!F34","v":""},null,{"$f":"+Pivot!H34","v":""},null,{"$f":"+Pivot!I34","v":""}]
[{"$f":"+Pivot!G35","v":""},{"$f":"+Pivot!F35","v":""},null,{"$f":"+Pivot!H35","v":""},null,{"$f":"+Pivot!I35","v":""}]
[{"$f":"+Pivot!G36","v":""},{"$f":"+Pivot!F36","v":""},null,{"$f":"+Pivot!H36","v":""},null,{"$f":"+Pivot!I36","v":""}]
[{"$f":"+Pivot!G37","v":""},{"$f":"+Pivot!F37","v":""},null,{"$f":"+Pivot!H37","v":""},null,{"$f":"+Pivot!I37","v":""}]
[{"$f":"+Pivot!G38","v":""},{"$f":"+Pivot!F38","v":""},null,{"$f":"+Pivot!H38","v":""},null,{"$f":"+Pivot!I38","v":""}]
[{"$f":"+Pivot!G39","v":""},{"$f":"+Pivot!F39","v":""},null,{"$f":"+Pivot!H39","v":""},null,{"$f":"+Pivot!I39","v":""}]
[{"$f":"+Pivot!G40","v":""},{"$f":"+Pivot!F40","v":""},null,{"$f":"+Pivot!H40","v":""},null,{"$f":"+Pivot!I40","v":""}]
[{"$f":"+Pivot!G41","v":""},{"$f":"+Pivot!F41","v":""},null,{"$f":"+Pivot!H41","v":""},null,{"$f":"+Pivot!I41","v":""}]
[{"$f":"+Pivot!G42","v":""},{"$f":"+Pivot!F42","v":""},null,{"$f":"+Pivot!H42","v":""},null,{"$f":"+Pivot!I42","v":""}]
[{"$f":"+Pivot!G43","v":""},{"$f":"+Pivot!F43","v":""},null,{"$f":"+Pivot!H43","v":""},null,{"$f":"+Pivot!I43","v":""}]
[{"$f":"+Pivot!G44","v":""},{"$f":"+Pivot!F44","v":""},null,{"$f":"+Pivot!H44","v":""},null,{"$f":"+Pivot!I44","v":""}]
[{"$f":"+Pivot!G45","v":""},{"$f":"+Pivot!F45","v":""},null,{"$f":"+Pivot!H45","v":""},null,{"$f":"+Pivot!I45","v":""}]
[{"$f":"+Pivot!G46","v":""},{"$f":"+Pivot!F46","v":""},null,{"$f":"+Pivot!H46","v":""},null,{"$f":"+Pivot!I46","v":""}]
[{"$f":"+Pivot!G47","v":""},{"$f":"+Pivot!F47","v":""},null,{"$f":"+Pivot!H47","v":""},null,{"$f":"+Pivot!I47","v":""}]
[{"$f":"+Pivot!G48","v":""},{"$f":"+Pivot!F48","v":""},null,{"$f":"+Pivot!H48","v":""},null,{"$f":"+Pivot!I48","v":""}]
[{"$f":"+Pivot!G49","v":""},{"$f":"+Pivot!F49","v":""},null,{"$f":"+Pivot!H49","v":""},null,{"$f":"+Pivot!I49","v":""}]
[{"$f":"+Pivot!G50","v":""},{"$f":"+Pivot!F50","v":""},null,{"$f":"+Pivot!H50","v":""},null,{"$f":"+Pivot!I50","v":""}]
[{"$f":"+Pivot!G51","v":""},{"$f":"+Pivot!F51","v":""},null,{"$f":"+Pivot!H51","v":""},null,{"$f":"+Pivot!I51","v":""}]
[{"$f":"+Pivot!G52","v":""},{"$f":"+Pivot!F52","v":""},null,{"$f":"+Pivot!H52","v":""},null,{"$f":"+Pivot!I52","v":""}]
[{"$f":"+Pivot!G53","v":""},{"$f":"+Pivot!F53","v":""},null,{"$f":"+Pivot!H53","v":""},null,{"$f":"+Pivot!I53","v":""}]
[{"$f":"+Pivot!G54","v":""},{"$f":"+Pivot!F54","v":""},null,{"$f":"+Pivot!H54","v":""},null,{"$f":"+Pivot!I54","v":""}]
[{"$f":"+Pivot!G55","v":""},{"$f":"+Pivot!F55","v":""},null,{"$f":"+Pivot!H55","v":""},null,{"$f":"+Pivot!I55","v":""}]
[{"$f":"+Pivot!G56","v":""},{"$f":"+Pivot!F56","v":""},null,{"$f":"+Pivot!H56","v":""},null,{"$f":"+Pivot!I56","v":""}]
[{"$f":"+Pivot!G57","v":""},{"$f":"+Pivot!F57","v":""},null,{"$f":"+Pivot!H57","v":""},null,{"$f":"+Pivot!I57","v":""}]
[{"$f":"+Pivot!G58","v":""},{"$f":"+Pivot!F58","v":""},null,{"$f":"+Pivot!H58","v":""},null,{"$f":"+Pivot!I58","v":""}]
[{"$f":"+Pivot!G59","v":""},{"$f":"+Pivot!F59","v":""},null,{"$f":"+Pivot!H59","v":""},null,{"$f":"+Pivot!I59","v":""}]
[{"$f":"+Pivot!G60","v":""},{"$f":"+Pivot!F60","v":""},null,{"$f":"+Pivot!H60","v":""},null,{"$f":"+Pivot!I60","v":""}]
[{"$f":"+Pivot!G61","v":""},{"$f":"+Pivot!F61","v":""},null,{"$f":"+Pivot!H61","v":""},null,{"$f":"+Pivot!I61","v":""}]
[{"$f":"+Pivot!G62","v":""},{"$f":"+Pivot!F62","v":""},null,{"$f":"+Pivot!H62","v":""},null,{"$f":"+Pivot!I62","v":""}]
[{"$f":"+Pivot!G63","v":""},{"$f":"+Pivot!F63","v":""},null,{"$f":"+Pivot!H63","v":""},null,{"$f":"+Pivot!I63","v":""}]
[{"$f":"+Pivot!G64","v":""},{"$f":"+Pivot!F64","v":""},null,{"$f":"+Pivot!H64","v":""},null,{"$f":"+Pivot!I64","v":""}]
{"$rows_left_out":161}
{"sheet":"Pivot","index":7,"n_rows":224,"n_cols":9,"rows_kept":224,"cut":false,"hidden":false,"merged":[[0,0,14,8]]}
["DO NOT UPDATE"]
[]
[]
[]
[]
[]
[]
[]
[]
[]
[]
[]
[]
[]
[]
[]
[]
[]
[]
["Type","(All)"]
[]
["Sum of Amount"]
["Account ","Chart","Object Code\n (The Object code being used)","Total"]
["","UC",null,0,null,{"$f":"IF(A24>=0.01,A24,\"\")","v":""},{"$f":"IF(F24=\"\",\"\",B24)","v":""},{"$f":"IF(C24>=0.01,C24,\"\")","v":""},""]
[null,null,null,null,null,{"$f":"IF(A25>=0.01,A25,\"\")","v":""},{"$f":"IF(F25=\"\",\"\",B25)","v":""},"",""]
[null,null,null,null,null,{"$f":"IF(A26>=0.01,A26,\"\")","v":""},"","",""]
[null,null,null,null,null,"","","",""]
[null,null,null,null,null,"","","",""]
[null,null,null,null,null,"","","",""]
[null,null,null,null,null,"","","",""]
[null,null,null,null,null,"","","",""]
[null,null,null,null,null,"","","",""]
[null,null,null,null,null,"","","",""]
[null,null,null,null,null,"","","",""]
[null,null,null,null,null,"","","",""]
[null,null,null,null,null,"","","",""]
[null,null,null,null,null,"","","",""]
[null,null,null,null,null,"","","",""]
[null,null,null,null,null,"","","",""]
[null,null,null,null,null,"","","",""]
{"$rows_left_out":185}
{"sheet":"Object Codes","index":8,"n_rows":37,"n_cols":5,"rows_kept":37,"cut":false,"hidden":true,"merged":[[26,1,26,4],[33,1,33,4]]}
[]
[]
[]
[]
[null,"3200 - Do not use for 2-Ledger accounts.  Inter-Department Transfers"]
[null,"3201 - Do not use for 2-Ledger accounts.  Accounts outside of the School/College/Unit"]
[null,"3206 - Permanently between 2-Ledger accounts within the same School/College/Unit."]
[null,"3207 - Permanently between 2-Ledger accounts outside the School/College/Unit."]
[null,"3208 - One-time between 2-Ledger accounts within the same School/College/Unit."]
[null,"3209 - One-time between 2-Ledger accounts outside the School/College/Unit."]
[null,"3210 - Used for mandatory transfers to Accounting only."]
[]
[]
[]
[]
[]
[null,"3300 - Do not use for 2-Ledger accounts.  Inter-Department Transfers"]
[null,"3301 - Do not use for 2-Ledger accounts.  Accounts outside of the School/College/Unit"]
[null,"3306 - Permanently between 2-Ledger accounts within the same School/College/Unit."]
[null,"3307 - Permanently between 2-Ledger accounts outside the School/College/Unit."]
[null,"3308 - One-time between 2-Ledger accounts within the same School/College/Unit."]
[null,"3309 - One-time between 2-Ledger accounts outside the School/College/Unit."]
[null,"3310 - Used for mandatory transfers to Accounting only."]
[]
[]
[]
[null,"Tie to Budget Construction - TRANSFERS IN ONLY"]
[null,"3201 - Do not use for 2-Ledger accounts.  Accounts outside of the School/College/Unit",3201,{"$f":"SUMIFS('Transfer In'!F$10:F$109,'Transfer In'!C$10:C$109,B28)","v":0},{"$f":"IFERROR(D28*1,\"-\")","v":0}]
[null,"3207 - Permanently between 2-Ledger accounts outside the School/College/Unit.",3207,{"$f":"SUMIFS('Transfer In'!F$10:F$109,'Transfer In'!C$10:C$109,B29)","v":0},0]
[null,"3209 - One-time between 2-Ledger accounts outside the School/College/Unit.",3209,{"$f":"SUMIFS('Transfer In'!F$10:F$109,'Transfer In'!C$10:C$109,B30)","v":0},0]
[null,"3210 - Used for mandatory transfers to Accounting only.",3210,{"$f":"SUMIFS('Transfer In'!F$10:F$109,'Transfer In'!C$10:C$109,B31)","v":0},0]
[]
[]
[null,"Tie to Budget Construction - TRANSFERS IN ONLY"]
[null,"3301 - Do not use for 2-Ledger accounts.  Accounts outside of the School/College/Unit",3201,{"$f":"SUMIFS('Transfer Out'!F$10:F$209,'Transfer Out'!C$10:C$209,B35)","v":0},{"$f":"IFERROR(D35*1,\"-\")","v":0}]
[null,"3307 - Permanently between 2-Ledger accounts outside the School/College/Unit.",3207,{"$f":"SUMIFS('Transfer Out'!F$10:F$209,'Transfer Out'!C$10:C$209,B36)","v":0},0]
[null,"3309 - One-time between 2-Ledger accounts outside the School/College/Unit.",3209,{"$f":"SUMIFS('Transfer Out'!F$10:F$209,'Transfer Out'!C$10:C$209,B37)","v":0},0]